Reaction Details
TargetCarbonic anhydrase 1
LigandBDBM50098356
Substrate/Competitorn/a
Meas. Tech.ChEMBL_1505005 (CHEMBL3595787)
Ki 77±n/a nM
Citation Ibrahim, DALasheen, DSZaky, MYIbrahim, AWVullo, DCeruso, MSupuran, CTAbou El Ella, DA Design and synthesis of benzothiazole-6-sulfonamides acting as highly potent inhibitors of carbonic anhydrase isoforms I, II, IX and XII. Bioorg Med Chem23:4989-99 (2015) 
 
Carbonic anhydrase 1
Name:Carbonic anhydrase 1
Type:Enzyme
Mol. Mass.:28873.37
Organism:Homo sapiens (Human)
Description:P00915
Residue:261
BDBM50098356
NameBDBM50098356
Synonyms:CHEMBL3594417
TypeSmall organic molecule
Emp. Form.C20H16N8O3S3
Mol. Mass.512.588
SMILESNS(=O)(=O)c1ccc2nc(NC(=O)Cn3ncc(C#N)c3NC(=S)Nc3ccccc3)sc2c1