Reaction Details
TargetCarbonic anhydrase 2
LigandBDBM50098360
Substrate/Competitorn/a
Meas. Tech.ChEMBL_1505006 (CHEMBL3595788)
Ki 4.7±n/a nM
Citation Ibrahim, DALasheen, DSZaky, MYIbrahim, AWVullo, DCeruso, MSupuran, CTAbou El Ella, DA Design and synthesis of benzothiazole-6-sulfonamides acting as highly potent inhibitors of carbonic anhydrase isoforms I, II, IX and XII. Bioorg Med Chem23:4989-99 (2015) 
 
Carbonic anhydrase 2
Name:Carbonic anhydrase 2
Type:Enzyme
Mol. Mass.:29250.71
Organism:Homo sapiens (Human)
Description:P00918
Residue:260
BDBM50098360
NameBDBM50098360
Synonyms:CHEMBL3594413
TypeSmall organic molecule
Emp. Form.C14H12N8O3S2
Mol. Mass.404.427
SMILESNc1ncnc2n(CC(=O)Nc3nc4ccc(cc4s3)S(N)(=O)=O)ncc12