Reaction Details
TargetCarbonic anhydrase 2
LigandBDBM50098359
Substrate/Competitorn/a
Meas. Tech.ChEMBL_1505006 (CHEMBL3595788)
Ki 8.6±n/a nM
Citation Ibrahim, DALasheen, DSZaky, MYIbrahim, AWVullo, DCeruso, MSupuran, CTAbou El Ella, DA Design and synthesis of benzothiazole-6-sulfonamides acting as highly potent inhibitors of carbonic anhydrase isoforms I, II, IX and XII. Bioorg Med Chem23:4989-99 (2015) 
 
Carbonic anhydrase 2
Name:Carbonic anhydrase 2
Type:Enzyme
Mol. Mass.:29250.71
Organism:Homo sapiens (Human)
Description:P00918
Residue:260
BDBM50098359
NameBDBM50098359
Synonyms:CHEMBL3594414
TypeSmall organic molecule
Emp. Form.C15H14N8O3S3
Mol. Mass.450.518
SMILESCSc1nn(CC(=O)Nc2nc3ccc(cc3s2)S(N)(=O)=O)c2ncnc(N)c12