Reaction Details
TargetCarbonic anhydrase 9
LigandBDBM50098367
Substrate/Competitorn/a
Meas. Tech.ChEMBL_1505007 (CHEMBL3595789)
Ki 282±n/a nM
Citation Ibrahim, DALasheen, DSZaky, MYIbrahim, AWVullo, DCeruso, MSupuran, CTAbou El Ella, DA Design and synthesis of benzothiazole-6-sulfonamides acting as highly potent inhibitors of carbonic anhydrase isoforms I, II, IX and XII. Bioorg Med Chem23:4989-99 (2015) 
 
Carbonic anhydrase 9
Name:Carbonic anhydrase 9
Type:Enzyme
Mol. Mass.:49669.03
Organism:Homo sapiens (Human)
Description:Catalytic domain of human cloned isozyme was used in the assay
Residue:459
BDBM50098367
NameBDBM50098367
Synonyms:CHEMBL3594405
TypeSmall organic molecule
Emp. Form.C13H11N5O5S3
Mol. Mass.413.452
SMILESNS(=O)(=O)c1ccc2nc(NC(=O)CSc3nc(O)cc(=O)[nH]3)sc2c1