Reaction Details
TargetCarbonic anhydrase 9
LigandBDBM50098364
Substrate/Competitorn/a
Meas. Tech.ChEMBL_1505007 (CHEMBL3595789)
Ki 135±n/a nM
Citation Ibrahim, DALasheen, DSZaky, MYIbrahim, AWVullo, DCeruso, MSupuran, CTAbou El Ella, DA Design and synthesis of benzothiazole-6-sulfonamides acting as highly potent inhibitors of carbonic anhydrase isoforms I, II, IX and XII. Bioorg Med Chem23:4989-99 (2015) 
 
Carbonic anhydrase 9
Name:Carbonic anhydrase 9
Type:Enzyme
Mol. Mass.:49669.03
Organism:Homo sapiens (Human)
Description:Catalytic domain of human cloned isozyme was used in the assay
Residue:459
BDBM50098364
NameBDBM50098364
Synonyms:CHEMBL3594409
TypeSmall organic molecule
Emp. Form.C18H15Cl2N7O4S3
Mol. Mass.560.457
SMILESNn1c(COc2ccc(Cl)cc2Cl)nnc1SCC(=O)Nc1nc2ccc(cc2s1)S(N)(=O)=O