Reaction Details
TargetCarbonic anhydrase 9
LigandBDBM50098363
Substrate/Competitorn/a
Meas. Tech.ChEMBL_1505007 (CHEMBL3595789)
Ki 4.8±n/a nM
Citation Ibrahim, DALasheen, DSZaky, MYIbrahim, AWVullo, DCeruso, MSupuran, CTAbou El Ella, DA Design and synthesis of benzothiazole-6-sulfonamides acting as highly potent inhibitors of carbonic anhydrase isoforms I, II, IX and XII. Bioorg Med Chem23:4989-99 (2015) 
 
Carbonic anhydrase 9
Name:Carbonic anhydrase 9
Type:Enzyme
Mol. Mass.:49669.03
Organism:Homo sapiens (Human)
Description:Catalytic domain of human cloned isozyme was used in the assay
Residue:459
BDBM50098363
NameBDBM50098363
Synonyms:CHEMBL3594410
TypeSmall organic molecule
Emp. Form.C15H15N5O5S3
Mol. Mass.441.505
SMILESNS(=O)(=O)c1ccc(NCC(=O)Nc2nc3ccc(cc3s2)S(N)(=O)=O)cc1