Reaction Details
TargetCarbonic anhydrase 9
LigandBDBM50098354
Substrate/Competitorn/a
Meas. Tech.ChEMBL_1505007 (CHEMBL3595789)
Ki 3.9±n/a nM
Citation Ibrahim, DALasheen, DSZaky, MYIbrahim, AWVullo, DCeruso, MSupuran, CTAbou El Ella, DA Design and synthesis of benzothiazole-6-sulfonamides acting as highly potent inhibitors of carbonic anhydrase isoforms I, II, IX and XII. Bioorg Med Chem23:4989-99 (2015) 
 
Carbonic anhydrase 9
Name:Carbonic anhydrase 9
Type:Enzyme
Mol. Mass.:49669.03
Organism:Homo sapiens (Human)
Description:Catalytic domain of human cloned isozyme was used in the assay
Residue:459
BDBM50098354
NameBDBM50098354
Synonyms:CHEMBL3594418
TypeSmall organic molecule
Emp. Form.C21H18N8O3S4
Mol. Mass.558.679
SMILESCSc1nn(CC(=O)Nc2nc3ccc(cc3s2)S(N)(=O)=O)c(NC(=S)Nc2ccccc2)c1C#N