Reaction Details
TargetCarbonic anhydrase 12
LigandBDBM50098356
Substrate/Competitorn/a
Meas. Tech.ChEMBL_1505008 (CHEMBL3595790)
Ki 5.2±n/a nM
Citation Ibrahim, DALasheen, DSZaky, MYIbrahim, AWVullo, DCeruso, MSupuran, CTAbou El Ella, DA Design and synthesis of benzothiazole-6-sulfonamides acting as highly potent inhibitors of carbonic anhydrase isoforms I, II, IX and XII. Bioorg Med Chem23:4989-99 (2015) 
 
Carbonic anhydrase 12
Name:Carbonic anhydrase 12
Type:Enzyme
Mol. Mass.:39456.00
Organism:Homo sapiens (Human)
Description:Catalytic domain of human cloned isozyme was used in the assay
Residue:354
BDBM50098356
NameBDBM50098356
Synonyms:CHEMBL3594417
TypeSmall organic molecule
Emp. Form.C20H16N8O3S3
Mol. Mass.512.588
SMILESNS(=O)(=O)c1ccc2nc(NC(=O)Cn3ncc(C#N)c3NC(=S)Nc3ccccc3)sc2c1