Reaction Details
TargetSodium-dependent noradrenaline transporter
LigandBDBM50098409
Substrate/Competitorn/a
Meas. Tech.ChEMBL_1505018 (CHEMBL3595873)
IC50 13±n/a nM
Citation Fujimori, IYukawa, TKamei, TNakada, YSakauchi, NYamada, MOhba, YTakiguchi, MKuno, MKamo, INakagawa, HHamada, TIgari, TOkuda, TYamamoto, STsukamoto, TIshichi, YUeno, H Design, synthesis and biological evaluation of a novel series of peripheral-selective noradrenaline reuptake inhibitor. Bioorg Med Chem23:5000-14 (2015) 
 
Sodium-dependent noradrenaline transporter
Name:Sodium-dependent noradrenaline transporter
Type:Multi-pass membrane protein
Mol. Mass.:69337.72
Organism:Homo sapiens (Human)
Description:P23975
Residue:617
BDBM50098409
NameBDBM50098409
Synonyms:CHEMBL3593403
TypeSmall organic molecule
Emp. Form.C18H22ClFN2O6
Mol. Mass.416.828
SMILESOC(=O)\C=C\C(O)=O.CC(=O)NC[C@@H]1CNCCO[C@H]1c1ccc(F)c(Cl)c1