Reaction Details
TargetSodium-dependent noradrenaline transporter
LigandBDBM50098370
Substrate/Competitorn/a
Meas. Tech.ChEMBL_1505018 (CHEMBL3595873)
IC50 12±n/a nM
Citation Fujimori, IYukawa, TKamei, TNakada, YSakauchi, NYamada, MOhba, YTakiguchi, MKuno, MKamo, INakagawa, HHamada, TIgari, TOkuda, TYamamoto, STsukamoto, TIshichi, YUeno, H Design, synthesis and biological evaluation of a novel series of peripheral-selective noradrenaline reuptake inhibitor. Bioorg Med Chem23:5000-14 (2015) 
 
Sodium-dependent noradrenaline transporter
Name:Sodium-dependent noradrenaline transporter
Type:Multi-pass membrane protein
Mol. Mass.:69337.72
Organism:Homo sapiens (Human)
Description:P23975
Residue:617
BDBM50098370
NameBDBM50098370
Synonyms:CHEMBL3593398
TypeSmall organic molecule
Emp. Form.C13H17Cl3N2O2
Mol. Mass.339.645
SMILESCl.CNC(=O)[C@@H]1CNCCO[C@H]1c1ccc(Cl)c(Cl)c1