Reaction Details
TargetHistone deacetylase 6
LigandBDBM50098420
Substrate/Competitorn/a
Meas. Tech.ChEMBL_1505087 (CHEMBL3596006)
IC50 35±n/a nM
Citation Clausen, DJSmith, WBHaines, BEWiest, OBradner, JEWilliams, RM Modular synthesis and biological activity of pyridyl-based analogs of the potent Class I Histone Deacetylase Inhibitor Largazole. Bioorg Med Chem23:5061-74 (2015) 
 
Histone deacetylase 6
Name:Histone deacetylase 6
Type:Chromatin regulator; hydrolase; repressor
Mol. Mass.:131381.51
Organism:Homo sapiens (Human)
Description:Q9UBN7
Residue:1215
BDBM50098420
NameBDBM50098420
Synonyms:CHEMBL3593411
TypeSmall organic molecule
Emp. Form.C23H30N4O4S2
Mol. Mass.490.639
SMILESCC(C)[C@@H]1NC(=O)[C@]2(C)CSC(=N2)c2ccnc(CNC(=O)C[C@H](OC1=O)\C=C\CCS)c2