Reaction Details
TargetCarbonic anhydrase
LigandBDBM10880
Substrate/Competitorn/a
Meas. Tech.ChEMBL_1504763 (CHEMBL3595048)
Ki 63±n/a nM
Citation De Luca, VVullo, DDel Prete, SCarginale, VScozzafava, AOsman, SMAlOthman, ZSupuran, CTCapasso, C Cloning, characterization and anion inhibition studies of a new¿-carbonic anhydrase from the Antarctic bacterium Pseudoalteromonas haloplanktis. Bioorg Med Chem23:4405-9 (2015) 
 
Carbonic anhydrase
Name:Carbonic anhydrase
Type:Protein
Mol. Mass.:26390.56
Organism:Methanosarcina thermophila
Description:P40881
Residue:247
BDBM10880
NameBDBM10880
Synonyms:AZA AZM acetazolamide Acetazolamide Acetazolamide (AZA) Acetazolamide, 5 Acetazolamide, AZA CHEMBL20 Sulfonamide, 1 US11278534, Example acetazolamide sulfonamide 1
TypeSmall organic molecule
Emp. Form.C4H6N4O3S2
Mol. Mass.222.245
SMILESCC(=O)Nc1nnc(s1)S(N)(=O)=O