Reaction Details
TargetTrypsin
LigandBDBM50098595
Substrate/Competitorn/a
Meas. Tech.ChEMBL_1504787 (CHEMBL3595072)
Ki 2700±n/a nM
Citation Priestley, ESCheney, DLDeLucca, IWei, ALuettgen, JMRendina, ARWong, PCWexler, RR Structure-Based Design of Macrocyclic Coagulation Factor VIIa Inhibitors. J Med Chem58:6225-36 (2015) 
 
Trypsin
Name:Trypsin
Synonyms:Serine protease 1/Trypsin-2/Trypsin-3
Type:n/a
Mol. Mass.:n/a
Description:ASSAY_ID of ChEMBL is 2155713
Components:This complex has 3 components.
Component 1
Name:Serine protease 1
Type:Enzyme
Mol. Mass.:26557.80
Organism:Homo sapiens (Human)
Description:P07477
Residue:247
Component 2
Name:Trypsin-2
Synonyms:Anionic trypsinogen Serine protease 2 TRY2_HUMAN Thrombin & trypsin Trypsin II | Trypsin-2
Type:PROTEIN
Mol. Mass.:26479.43
Organism:Homo sapiens (Human)
Description:ChEMBL_41517
Residue:247
Component 3
Name:Trypsin-3
Synonyms:Brain trypsinogen PRSS3 Serine protease 3 TRY3 TRY4 Trypsin Trypsin IV | Trypsin-3
Type:PROTEIN
Mol. Mass.:32532.52
Organism:Homo sapiens (Human)
Description:ChEMBL_216043
Residue:304
BDBM50098595
NameBDBM50098595
Synonyms:CHEMBL3594314
TypeSmall organic molecule
Emp. Form.C31H33N5O4S
Mol. Mass.571.69
SMILESCCS(=O)(=O)c1ccc2NC(=O)CCCc3ccc(cc3C)[C@@H](Nc3ccc4c(N)nccc4c3)C(=O)NCc1c2