Reaction Details
TargetVitamin K-dependent protein C
LigandBDBM50098598
Substrate/Competitorn/a
Meas. Tech.ChEMBL_1504786 (CHEMBL3595071)
Ki 1800±n/a nM
Citation Priestley, ESCheney, DLDeLucca, IWei, ALuettgen, JMRendina, ARWong, PCWexler, RR Structure-Based Design of Macrocyclic Coagulation Factor VIIa Inhibitors. J Med Chem58:6225-36 (2015) 
 
Vitamin K-dependent protein C
Name:Vitamin K-dependent protein C
Type:Enzyme
Mol. Mass.:52067.73
Organism:Homo sapiens (Human)
Description:n/a
Residue:461
BDBM50098598
NameBDBM50098598
Synonyms:CHEMBL3594311
TypeSmall organic molecule
Emp. Form.C31H33N5O4S
Mol. Mass.571.69
SMILESCC(C)S(=O)(=O)c1ccc2NC(=O)CCCc3ccc(cc3)[C@@H](Nc3ccc4c(N)nccc4c3)C(=O)NCc1c2