Reaction Details
TargetProthrombin
LigandBDBM50098595
Substrate/Competitorn/a
Meas. Tech.ChEMBL_1504785 (CHEMBL3595070)
Ki 6700±n/a nM
Citation Priestley, ESCheney, DLDeLucca, IWei, ALuettgen, JMRendina, ARWong, PCWexler, RR Structure-Based Design of Macrocyclic Coagulation Factor VIIa Inhibitors. J Med Chem58:6225-36 (2015) 
 
Prothrombin
Name:Prothrombin
Type:Protein
Mol. Mass.:70029.57
Organism:Homo sapiens (Human)
Description:P00734
Residue:622
BDBM50098595
NameBDBM50098595
Synonyms:CHEMBL3594314
TypeSmall organic molecule
Emp. Form.C31H33N5O4S
Mol. Mass.571.69
SMILESCCS(=O)(=O)c1ccc2NC(=O)CCCc3ccc(cc3C)[C@@H](Nc3ccc4c(N)nccc4c3)C(=O)NCc1c2