Reaction Details
TargetProthrombin
LigandBDBM50098591
Substrate/Competitorn/a
Meas. Tech.ChEMBL_1504785 (CHEMBL3595070)
Ki>13000±n/a nM
Citation Priestley, ESCheney, DLDeLucca, IWei, ALuettgen, JMRendina, ARWong, PCWexler, RR Structure-Based Design of Macrocyclic Coagulation Factor VIIa Inhibitors. J Med Chem58:6225-36 (2015) 
 
Prothrombin
Name:Prothrombin
Type:Protein
Mol. Mass.:70029.57
Organism:Homo sapiens (Human)
Description:P00734
Residue:622
BDBM50098591
NameBDBM50098591
Synonyms:CHEMBL3594305
TypeSmall organic molecule
Emp. Form.C28H27N5O2
Mol. Mass.465.5463
SMILESNc1nccc2cc(N[C@@H]3c4ccc(CCCC(=O)Nc5cccc(CNC3=O)c5)cc4)ccc12