Reaction Details
TargetCoagulation factor X
LigandBDBM50098599
Substrate/Competitorn/a
Meas. Tech.ChEMBL_1504784 (CHEMBL3595069)
Ki 3200±n/a nM
Citation Priestley, ESCheney, DLDeLucca, IWei, ALuettgen, JMRendina, ARWong, PCWexler, RR Structure-Based Design of Macrocyclic Coagulation Factor VIIa Inhibitors. J Med Chem58:6225-36 (2015) 
 
Coagulation factor X
Name:Coagulation factor X
Type:Enzyme
Mol. Mass.:54726.60
Organism:Homo sapiens (Human)
Description:n/a
Residue:488
BDBM50098599
NameBDBM50098599
Synonyms:CHEMBL3594310
TypeSmall organic molecule
Emp. Form.C30H31N5O4S
Mol. Mass.557.663
SMILESCCS(=O)(=O)c1ccc2NC(=O)CCCc3ccc(cc3)[C@@H](Nc3ccc4c(N)nccc4c3)C(=O)NCc1c2