Reaction Details
TargetCoagulation factor IX
LigandBDBM50098596
Substrate/Competitorn/a
Meas. Tech.ChEMBL_1504783 (CHEMBL3595068)
Ki 34000±n/a nM
Citation Priestley, ESCheney, DLDeLucca, IWei, ALuettgen, JMRendina, ARWong, PCWexler, RR Structure-Based Design of Macrocyclic Coagulation Factor VIIa Inhibitors. J Med Chem58:6225-36 (2015) 
 
Coagulation factor IX
Name:Coagulation factor IX
Type:Enzyme
Mol. Mass.:51768.83
Organism:Homo sapiens (Human)
Description:P00740
Residue:461
BDBM50098596
NameBDBM50098596
Synonyms:CHEMBL3594313
TypeSmall organic molecule
Emp. Form.C28H31N5O4S
Mol. Mass.533.642
SMILESCCS(=O)(=O)c1ccc2NC(=O)CCCc3ccc(cc3)[C@@H](Nc3ccc(cc3)C(N)=N)C(=O)NCc1c2