Reaction Details
TargetCoagulation factor VII/Tissue factor
LigandBDBM50098655
Substrate/Competitorn/a
Meas. Tech.ChEMBL_1504782 (CHEMBL3595067)
Ki 54000±n/a nM
Citation Priestley, ESCheney, DLDeLucca, IWei, ALuettgen, JMRendina, ARWong, PCWexler, RR Structure-Based Design of Macrocyclic Coagulation Factor VIIa Inhibitors. J Med Chem58:6225-36 (2015) 
 
Coagulation factor VII/Tissue factor
Name:Coagulation factor VII/Tissue factor
Type:n/a
Mol. Mass.:n/a
Description:ASSAY_ID of EBI is 69535
Components:This complex has 2 components.
Component 1
Name:Tissue factor
Synonyms:CD_antigen=CD142 Coagulation factor VII/tissue factor TF Thromboplastin | Tissue factor
Type:PROTEIN
Mol. Mass.:33067.61
Organism:Homo sapiens (Human)
Description:ChEMBL_936735
Residue:295
Component 2
Name:Coagulation factor VII
Synonyms:Eptacog alfa FA7_HUMAN Factor VIIa (fVIIa) SPCA serum prothrombin conversion accelerator
Type:Enzyme
Mol. Mass.:51599.89
Organism:Homo sapiens (Human)
Description:n/a
Residue:466
BDBM50098655
NameBDBM50098655
Synonyms:CHEMBL3594308
TypeSmall organic molecule
Emp. Form.C24H22N4O
Mol. Mass.382.4577
SMILESNc1nccc2cc(NC(C(=O)NCc3ccccc3)c3ccccc3)ccc12