Reaction Details
TargetCoagulation factor VII/Tissue factor
LigandBDBM50098666
Substrate/Competitorn/a
Meas. Tech.ChEMBL_1504782 (CHEMBL3595067)
Ki 4600±n/a nM
Citation Priestley, ESCheney, DLDeLucca, IWei, ALuettgen, JMRendina, ARWong, PCWexler, RR Structure-Based Design of Macrocyclic Coagulation Factor VIIa Inhibitors. J Med Chem58:6225-36 (2015) 
 
Coagulation factor VII/Tissue factor
Name:Coagulation factor VII/Tissue factor
Type:n/a
Mol. Mass.:n/a
Description:ASSAY_ID of EBI is 69535
Components:This complex has 2 components.
Component 1
Name:Tissue factor
Synonyms:CD_antigen=CD142 Coagulation factor VII/tissue factor TF Thromboplastin | Tissue factor
Type:PROTEIN
Mol. Mass.:33067.61
Organism:Homo sapiens (Human)
Description:ChEMBL_936735
Residue:295
Component 2
Name:Coagulation factor VII
Synonyms:Eptacog alfa FA7_HUMAN Factor VIIa (fVIIa) SPCA serum prothrombin conversion accelerator
Type:Enzyme
Mol. Mass.:51599.89
Organism:Homo sapiens (Human)
Description:n/a
Residue:466
BDBM50098666
NameBDBM50098666
Synonyms:CHEMBL3594307
TypeSmall organic molecule
Emp. Form.C27H25N5O2
Mol. Mass.451.5197
SMILESNc1nccc2cc(NC3c4ccc(CCC(=O)Nc5cccc(CNC3=O)c5)cc4)ccc12