Reaction Details
TargetRap guanine nucleotide exchange factor 3
LigandBDBM50011360
Substrate/Competitorn/a
Meas. Tech.ChEMBL_1504800 (CHEMBL3595153)
IC50 10800±n/a nM
Citation Ye, NZhu, YChen, HLiu, ZMei, FCWild, CChen, HCheng, XZhou, J Structure-Activity Relationship Studies of Substituted 2-(Isoxazol-3-yl)-2-oxo-N'-phenyl-acetohydrazonoyl Cyanide Analogues: Identification of Potent Exchange Proteins Directly Activated by cAMP (EPAC) Antagonists. J Med Chem58:6033-47 (2015) 
 
Rap guanine nucleotide exchange factor 3
Name:Rap guanine nucleotide exchange factor 3
Type:PROTEIN
Mol. Mass.:103769.52
Organism:Homo sapiens (Human)
Description:ChEMBL_104531
Residue:923
BDBM50011360
NameBDBM50011360
Synonyms:CHEMBL3260990
TypeSmall organic molecule
Emp. Form.C16H15ClN4O2
Mol. Mass.330.769
SMILESCC(C)(C)c1cc(no1)C(=O)C(=N\Nc1cccc(Cl)c1)\C#N