Reaction Details
TargetAlpha-1D adrenergic receptor
LigandBDBM50099460
Substrate/Competitorn/a
Meas. Tech.ChEMBL_1440680 (CHEMBL3381315)
Ki 5.8±n/a nM
Citation Franchini, SBattisti, UMBaraldi, APrandi, AFossa, PCichero, ETait, ASorbi, CMarucci, GCilia, APirona, LBrasili, L Structure-affinity/activity relationships of 1,4-dioxa-spiro[4.5]decane based ligands ata<alpha>1 and 5-HT1A receptors. Eur J Med Chem87:248-66 (2014) 
 
Alpha-1D adrenergic receptor
Name:Alpha-1D adrenergic receptor
Type:Enzyme Catalytic Domain
Mol. Mass.:60485.82
Organism:Homo sapiens (Human)
Description:adrenergic Alpha1D ADRA1D HUMAN::P25100
Residue:572
BDBM50099460
NameBDBM50099460
Synonyms:CHEMBL3342870
TypeSmall organic molecule
Emp. Form.C25H32N4O7S
Mol. Mass.532.609
SMILESCOc1ccccc1N1CCN(CC2COC3(CCN(CC3)S(=O)(=O)c3ccc(cc3)[N+]([O-])=O)O2)CC1