Reaction Details
TargetAlpha-1A adrenergic receptor
LigandBDBM50099461
Substrate/Competitorn/a
Meas. Tech.ChEMBL_1440678 (CHEMBL3390430)
Ki 3.0±n/a nM
Citation Franchini, SBattisti, UMBaraldi, APrandi, AFossa, PCichero, ETait, ASorbi, CMarucci, GCilia, APirona, LBrasili, L Structure-affinity/activity relationships of 1,4-dioxa-spiro[4.5]decane based ligands ata<alpha>1 and 5-HT1A receptors. Eur J Med Chem87:248-66 (2014) 
 
Alpha-1A adrenergic receptor
Name:Alpha-1A adrenergic receptor
Type:Cell-surface receptors
Mol. Mass.:51511.67
Organism:Homo sapiens (Human)
Description:P35348
Residue:466
BDBM50099461
NameBDBM50099461
Synonyms:CHEMBL3342871
TypeSmall organic molecule
Emp. Form.C25H32N4O7S
Mol. Mass.532.609
SMILESCOc1ccccc1N1CCN(CC2COC3(CCN(CC3)S(=O)(=O)c3cccc(c3)[N+]([O-])=O)O2)CC1