Reaction Details
TargetAcetylcholinesterase
LigandBDBM8961
Substrate/Competitorn/a
Meas. Tech.ChEMBL_1431528 (CHEMBL3390449)
IC50 260±n/a nM
Citation Lan, JSXie, SSLi, SYPan, LFWang, XBKong, LY Design, synthesis and evaluation of novel tacrine-(ß-carboline) hybrids as multifunctional agents for the treatment of Alzheimer's disease. Bioorg Med Chem22:6089-104 (2014) 
 
Acetylcholinesterase
Name:Acetylcholinesterase
Type:Enzyme
Mol. Mass.:71812.79
Organism:Electrophorus electricus (Electric eel)
Description:n/a
Residue:633
BDBM8961
NameBDBM8961
Synonyms:1,2,3,4-tetrahydro-9-acridinamine 9-THA CHEMBL1337960 Cognex Tracine cid_1935 | tacrine.HCl
TypeSmall organic molecule
Emp. Form.C13H14N2
Mol. Mass.198.2637
SMILESNc1c2CCCCc2nc2ccccc12