Reaction Details
TargetAcetylcholinesterase
LigandBDBM50243981
Substrate/Competitorn/a
Meas. Tech.ChEMBL_1431528 (CHEMBL3390449)
IC50 63000±n/a nM
Citation Lan, JSXie, SSLi, SYPan, LFWang, XBKong, LY Design, synthesis and evaluation of novel tacrine-(ß-carboline) hybrids as multifunctional agents for the treatment of Alzheimer's disease. Bioorg Med Chem22:6089-104 (2014) 
 
Acetylcholinesterase
Name:Acetylcholinesterase
Type:Enzyme
Mol. Mass.:71812.79
Organism:Electrophorus electricus (Electric eel)
Description:n/a
Residue:633
BDBM50243981
NameBDBM50243981
Synonyms:Beta CCM Methyl Beta-carboline-3 carboxylate | methyl 9H-pyrido[3,4-b]indole-3-carboxylate
TypeSmall organic molecule
Emp. Form.C13H10N2O2
Mol. Mass.226.2307
SMILESCOC(=O)c1cc2c(cn1)[nH]c1ccccc21