Reaction Details
TargetPotassium voltage-gated channel subfamily H member 2
LigandBDBM50100083
Substrate/Competitorn/a
Meas. Tech.ChEMBL_1446841 (CHEMBL3371912)
IC50 4300±n/a nM
Citation Ramachandran, SHameed P, SSrivastava, AShanbhag, GMorayya, SRautela, NAwasthy, DKavanagh, SBharath, SReddy, JPanduga, VPrabhakar, KRSaralaya, RNanduri, RRaichurkar, AMenasinakai, SAchar, VJiménez-Díaz, MBMartínez, MSAngulo-Barturen, IFerrer, SSanz, LMGamo, FJDuffy, SAvery, VMWaterson, DLee, MCCoburn-Flynn, OFidock, DAIyer, PSNarayanan, SHosagrahara, VSambandamurthy, VK N-aryl-2-aminobenzimidazoles: novel, efficacious, antimalarial lead compounds. J Med Chem57:6642-52 (2014) 
 
Potassium voltage-gated channel subfamily H member 2
Name:Potassium voltage-gated channel subfamily H member 2
Type:Multi-pass membrane protein
Mol. Mass.:126672.65
Organism:Homo sapiens (Human)
Description:Q12809
Residue:1159
BDBM50100083
NameBDBM50100083
Synonyms:CHEMBL3321972
TypeSmall organic molecule
Emp. Form.C19H20F3N5
Mol. Mass.375.3908
SMILESCN1CCC(CC1)c1ccc2nc(Nc3ccc(cn3)C(F)(F)F)[nH]c2c1