Reaction Details
TargetPotassium voltage-gated channel subfamily H member 2
LigandBDBM50100085
Substrate/Competitorn/a
Meas. Tech.ChEMBL_1446841 (CHEMBL3371912)
IC50 8800±n/a nM
Citation Ramachandran, SHameed P, SSrivastava, AShanbhag, GMorayya, SRautela, NAwasthy, DKavanagh, SBharath, SReddy, JPanduga, VPrabhakar, KRSaralaya, RNanduri, RRaichurkar, AMenasinakai, SAchar, VJiménez-Díaz, MBMartínez, MSAngulo-Barturen, IFerrer, SSanz, LMGamo, FJDuffy, SAvery, VMWaterson, DLee, MCCoburn-Flynn, OFidock, DAIyer, PSNarayanan, SHosagrahara, VSambandamurthy, VK N-aryl-2-aminobenzimidazoles: novel, efficacious, antimalarial lead compounds. J Med Chem57:6642-52 (2014) 
 
Potassium voltage-gated channel subfamily H member 2
Name:Potassium voltage-gated channel subfamily H member 2
Type:Multi-pass membrane protein
Mol. Mass.:126672.65
Organism:Homo sapiens (Human)
Description:Q12809
Residue:1159
BDBM50100085
NameBDBM50100085
Synonyms:CHEMBL3321980
TypeSmall organic molecule
Emp. Form.C20H24FN7
Mol. Mass.381.4499
SMILESCN1CCN(CC1)c1cc2[nH]c(Nc3cc(C4CC4)c(F)c(C)n3)nc2cn1