Reaction Details
TargetPlatelet-derived growth factor receptor beta
LigandBDBM50192841
Substrate/Competitorn/a
Meas. Tech.ChEBML_1447789
IC50 4000±n/a nM
Citation Horbert, RPinchuk, BJohannes, ESchlosser, JSchmidt, DCappel, DTotzke, FSchächtele, CPeifer, C Optimization of potent DFG-in inhibitors of platelet derived growth factor receptorß (PDGF-Rß) guided by water thermodynamics. J Med Chem58:170-82 (2015) 
 
Platelet-derived growth factor receptor beta
Name:Platelet-derived growth factor receptor beta
Type:Enzyme
Mol. Mass.:123922.25
Organism:Homo sapiens (Human)
Description:P09619
Residue:1106
BDBM50192841
NameBDBM50192841
Synonyms:CHEMBL3358969
TypeSmall organic molecule
Emp. Form.C20H17N3O3
Mol. Mass.347.3673
SMILESCOc1cc(OC)cc(c1)-c1nc(c[nH]c1=O)-c1c[nH]c2ccccc12