Reaction Details
TargetVascular endothelial growth factor receptor 2
LigandBDBM50192846
Substrate/Competitorn/a
Meas. Tech.ChEBML_1447790
IC50 23000±n/a nM
Citation Horbert, RPinchuk, BJohannes, ESchlosser, JSchmidt, DCappel, DTotzke, FSchächtele, CPeifer, C Optimization of potent DFG-in inhibitors of platelet derived growth factor receptorß (PDGF-Rß) guided by water thermodynamics. J Med Chem58:170-82 (2015) 
 
Vascular endothelial growth factor receptor 2
Name:Vascular endothelial growth factor receptor 2
Type:Receptor Tyrosine Kinase
Mol. Mass.:151510.97
Organism:Homo sapiens (Human)
Description:P35968
Residue:1356
BDBM50192846
NameBDBM50192846
Synonyms:CHEMBL3358992
TypeSmall organic molecule
Emp. Form.C20H20N2O5
Mol. Mass.368.3832
SMILESCOc1cccc(c1)-c1c[nH]c(=O)c(n1)-c1cc(OC)c(OC)c(OC)c1