Reaction Details
TargetRAC-alpha serine/threonine-protein kinase
LigandBDBM50192858
Substrate/Competitorn/a
Meas. Tech.ChEBML_1448580
IC50>100000±n/a nM
Citation Horbert, RPinchuk, BJohannes, ESchlosser, JSchmidt, DCappel, DTotzke, FSchächtele, CPeifer, C Optimization of potent DFG-in inhibitors of platelet derived growth factor receptorß (PDGF-Rß) guided by water thermodynamics. J Med Chem58:170-82 (2015) 
 
RAC-alpha serine/threonine-protein kinase
Name:RAC-alpha serine/threonine-protein kinase
Type:Enzyme
Mol. Mass.:55681.25
Organism:Homo sapiens (Human)
Description:P31749
Residue:480
BDBM50192858
NameBDBM50192858
Synonyms:CHEMBL3358966
TypeSmall organic molecule
Emp. Form.C21H19N3O4
Mol. Mass.377.3933
SMILESCOc1cc(cc(OC)c1OC)-c1nc(c[nH]c1=O)-c1c[nH]c2ccccc12