Reaction Details
TargetPlatelet-derived growth factor receptor beta
LigandBDBM50192848
Substrate/Competitorn/a
Meas. Tech.ChEBML_1447789
IC50 5000±n/a nM
Citation Horbert, RPinchuk, BJohannes, ESchlosser, JSchmidt, DCappel, DTotzke, FSchächtele, CPeifer, C Optimization of potent DFG-in inhibitors of platelet derived growth factor receptorß (PDGF-Rß) guided by water thermodynamics. J Med Chem58:170-82 (2015) 
 
Platelet-derived growth factor receptor beta
Name:Platelet-derived growth factor receptor beta
Type:Enzyme
Mol. Mass.:123922.25
Organism:Homo sapiens (Human)
Description:P09619
Residue:1106
BDBM50192848
NameBDBM50192848
Synonyms:CHEMBL3358995
TypeSmall organic molecule
Emp. Form.C19H17ClN2O4
Mol. Mass.372.802
SMILESCOc1cc(cc(OC)c1OC)-c1nc(c[nH]c1=O)-c1ccccc1Cl