Reaction Details
TargetPlatelet-derived growth factor receptor beta
LigandBDBM50192865
Substrate/Competitorn/a
Meas. Tech.ChEBML_1447789
IC50 9000±n/a nM
Citation Horbert, RPinchuk, BJohannes, ESchlosser, JSchmidt, DCappel, DTotzke, FSchächtele, CPeifer, C Optimization of potent DFG-in inhibitors of platelet derived growth factor receptorß (PDGF-Rß) guided by water thermodynamics. J Med Chem58:170-82 (2015) 
 
Platelet-derived growth factor receptor beta
Name:Platelet-derived growth factor receptor beta
Type:Enzyme
Mol. Mass.:123922.25
Organism:Homo sapiens (Human)
Description:P09619
Residue:1106
BDBM50192865
NameBDBM50192865
Synonyms:CHEMBL3358982
TypeSmall organic molecule
Emp. Form.C23H21N3O6
Mol. Mass.435.4293
SMILESCOC(=O)c1ccc2c(c[nH]c2c1)-c1c[nH]c(=O)c(n1)-c1cc(OC)c(OC)c(OC)c1