Reaction Details
TargetEphrin type-A receptor 3
LigandBDBM50100316
Substrate/Competitorn/a
Meas. Tech.ChEMBL_1454051 (CHEMBL3361797)
Kd 8.6±n/a nM
Citation Unzue, ADong, JLafleur, KZhao, HFrugier, ECaflisch, ANevado, C Pyrrolo[3,2-b]quinoxaline derivatives as types I1/2 and II Eph tyrosine kinase inhibitors: structure-based design, synthesis, and in vivo validation. J Med Chem57:6834-44 (2014) 
 
Ephrin type-A receptor 3
Name:Ephrin type-A receptor 3
Type:Protein
Mol. Mass.:110131.95
Organism:Homo sapiens (Human)
Description:P29320
Residue:983
BDBM50100316
NameBDBM50100316
Synonyms:CHEMBL3321809
TypeSmall organic molecule
Emp. Form.C18H15N5O2
Mol. Mass.333.344
SMILESCc1ccc(O)cc1-n1c(N)c(C(N)=O)c2nc3ccccc3nc12