Reaction Details
Target5-hydroxytryptamine receptor 2A
LigandBDBM50100389
Substrate/Competitorn/a
Meas. Tech.ChEMBL_1454936 (CHEMBL3364547)
Ki 10±n/a nM
Citation Zhang, JHuang, JSong, ZGuo, LCai, WWang, YZhen, XZhang, A Structural manipulation on the catecholic fragment of dopamine D(1) receptor agonist 1-phenyl-N-methyl-benzazepines. Eur J Med Chem85:16-26 (2014) 
 
5-hydroxytryptamine receptor 2A
Name:5-hydroxytryptamine receptor 2A
Type:undefined
Mol. Mass.:52607.65
Organism:Homo sapiens (Human)
Description:P28223
Residue:471
BDBM50100389
NameBDBM50100389
Synonyms:CHEMBL3325905
TypeSmall organic molecule
Emp. Form.C24H25ClN2O
Mol. Mass.392.921
SMILESCN1CCc2cc(NCc3cccc(Cl)c3)c(O)cc2C(C1)c1ccccc1