Reaction Details
TargetBifunctional epoxide hydrolase 2
LigandBDBM50100519
Substrate/Competitorn/a
Meas. Tech.ChEMBL_1456719 (CHEMBL3371009)
IC50<1.3±n/a nM
Citation Lee, KSLiu, JYWagner, KMPakhomova, SDong, HMorisseau, CFu, SHYang, JWang, PUlu, AMate, CANguyen, LVHwang, SHEdin, MLMara, AAWulff, HNewcomer, MEZeldin, DCHammock, BD Optimized inhibitors of soluble epoxide hydrolase improve in vitro target residence time and in vivo efficacy. J Med Chem57:7016-30 (2014) 
 
Bifunctional epoxide hydrolase 2
Name:Bifunctional epoxide hydrolase 2
Type:PROTEIN
Mol. Mass.:62337.15
Organism:Rattus norvegicus
Description:ChEMBL_1465995
Residue:554
BDBM50100519
NameBDBM50100519
Synonyms:CHEMBL3327067 | US10377744, Compound No. 2391
TypeSmall organic molecule
Emp. Form.C18H24F3N3O2
Mol. Mass.371.3973
SMILESCC[C@H](C)C(=O)N1CCC(CC1)NC(=O)Nc1ccc(cc1)C(F)(F)F