Reaction Details
TargetBifunctional epoxide hydrolase 2
LigandBDBM50100525
Substrate/Competitorn/a
Meas. Tech.ChEMBL_1455803 (CHEMBL3361515)
Ki 1.2±n/a nM
Citation Lee, KSLiu, JYWagner, KMPakhomova, SDong, HMorisseau, CFu, SHYang, JWang, PUlu, AMate, CANguyen, LVHwang, SHEdin, MLMara, AAWulff, HNewcomer, MEZeldin, DCHammock, BD Optimized inhibitors of soluble epoxide hydrolase improve in vitro target residence time and in vivo efficacy. J Med Chem57:7016-30 (2014) 
 
Bifunctional epoxide hydrolase 2
Name:Bifunctional epoxide hydrolase 2
Type:Enzyme
Mol. Mass.:62613.07
Organism:Homo sapiens (Human)
Description:P34913
Residue:555
BDBM50100525
NameBDBM50100525
Synonyms:CHEMBL3327084
TypeSmall organic molecule
Emp. Form.C16H20F3N3O3S
Mol. Mass.391.409
SMILESFC(F)(F)c1ccc(NC(=O)NC2CCN(CC2)S(=O)(=O)C2CC2)cc1