Reaction Details
TargetBifunctional epoxide hydrolase 2
LigandBDBM50100531
Substrate/Competitorn/a
Meas. Tech.ChEMBL_1455803 (CHEMBL3361515)
Ki 0.230000±n/a nM
Citation Lee, KSLiu, JYWagner, KMPakhomova, SDong, HMorisseau, CFu, SHYang, JWang, PUlu, AMate, CANguyen, LVHwang, SHEdin, MLMara, AAWulff, HNewcomer, MEZeldin, DCHammock, BD Optimized inhibitors of soluble epoxide hydrolase improve in vitro target residence time and in vivo efficacy. J Med Chem57:7016-30 (2014) 
 
Bifunctional epoxide hydrolase 2
Name:Bifunctional epoxide hydrolase 2
Type:Enzyme
Mol. Mass.:62613.07
Organism:Homo sapiens (Human)
Description:P34913
Residue:555
BDBM50100531
NameBDBM50100531
Synonyms:CHEMBL3325465
TypeSmall organic molecule
Emp. Form.C19H35N3O2
Mol. Mass.337.5001
SMILESCCC(C)C(=O)N1CCC(CC1)NC(=O)N[C@H]1CC[C@H](CC)CC1