Reaction Details
TargetBifunctional epoxide hydrolase 2
LigandBDBM50335972
Substrate/Competitorn/a
Meas. Tech.ChEMBL_1455803 (CHEMBL3361515)
Ki 15±n/a nM
Citation Lee, KSLiu, JYWagner, KMPakhomova, SDong, HMorisseau, CFu, SHYang, JWang, PUlu, AMate, CANguyen, LVHwang, SHEdin, MLMara, AAWulff, HNewcomer, MEZeldin, DCHammock, BD Optimized inhibitors of soluble epoxide hydrolase improve in vitro target residence time and in vivo efficacy. J Med Chem57:7016-30 (2014) 
 
Bifunctional epoxide hydrolase 2
Name:Bifunctional epoxide hydrolase 2
Type:Enzyme
Mol. Mass.:62613.07
Organism:Homo sapiens (Human)
Description:P34913
Residue:555
BDBM50335972
NameBDBM50335972
Synonyms:1-(1-acetylpiperidin-4-yl)-3-(4-(trifluoromethyl)phenyl)urea | CHEMBL1668932
TypeSmall organic molecule
Emp. Form.C15H18F3N3O2
Mol. Mass.329.3175
SMILESCC(=O)N1CCC(CC1)NC(=O)Nc1ccc(cc1)C(F)(F)F