Reaction Details
TargetNociceptin receptor
LigandBDBM50100986
Substrate/Competitorn/a
Meas. Tech.ChEMBL_1452449 (CHEMBL3362473)
Ki 4.4±n/a nM
Citation Schunk, SLinz, KFrormann, SHinze, COberbörsch, SSundermann, BZemolka, SEnglberger, WGermann, TChristoph, TKögel, BYSchröder, WHarlfinger, SSaunders, DKless, ASchick, HSonnenschein, H Discovery of Spiro[cyclohexane-dihydropyrano[3,4-b]indole]-amines as Potent NOP and Opioid Receptor Agonists. ACS Med Chem Lett5:851-6 (2014) 
 
Nociceptin receptor
Name:Nociceptin receptor
Type:G Protein-Coupled Receptor (GPCR)
Mol. Mass.:40702.87
Organism:Homo sapiens (Human)
Description:P41146
Residue:370
BDBM50100986
NameBDBM50100986
Synonyms:CHEMBL3325747
TypeSmall organic molecule
Emp. Form.C22H30ClNO
Mol. Mass.359.933
SMILESCl.CN(C)[C@@]1(CC[C@@](O)(CCc2ccccc2)CC1)c1ccccc1