Reaction Details
TargetNociceptin receptor
LigandBDBM50100990
Substrate/Competitorn/a
Meas. Tech.ChEMBL_1452449 (CHEMBL3362473)
Ki 7.4±n/a nM
Citation Schunk, SLinz, KFrormann, SHinze, COberbörsch, SSundermann, BZemolka, SEnglberger, WGermann, TChristoph, TKögel, BYSchröder, WHarlfinger, SSaunders, DKless, ASchick, HSonnenschein, H Discovery of Spiro[cyclohexane-dihydropyrano[3,4-b]indole]-amines as Potent NOP and Opioid Receptor Agonists. ACS Med Chem Lett5:851-6 (2014) 
 
Nociceptin receptor
Name:Nociceptin receptor
Type:G Protein-Coupled Receptor (GPCR)
Mol. Mass.:40702.87
Organism:Homo sapiens (Human)
Description:P41146
Residue:370
BDBM50100990
NameBDBM50100990
Synonyms:CHEMBL3325878
TypeSmall organic molecule
Emp. Form.C22H32Cl2N2
Mol. Mass.395.409
SMILESCl.Cl.CN(C)[C@]1(CC[C@@H](CC1)NCCc1ccccc1)c1ccccc1