Reaction Details
TargetKappa-type opioid receptor
LigandBDBM50100983
Substrate/Competitorn/a
Meas. Tech.ChEMBL_1452454 (CHEMBL3362478)
Ki 2.3±n/a nM
Citation Schunk, SLinz, KFrormann, SHinze, COberbörsch, SSundermann, BZemolka, SEnglberger, WGermann, TChristoph, TKögel, BYSchröder, WHarlfinger, SSaunders, DKless, ASchick, HSonnenschein, H Discovery of Spiro[cyclohexane-dihydropyrano[3,4-b]indole]-amines as Potent NOP and Opioid Receptor Agonists. ACS Med Chem Lett5:851-6 (2014) 
 
Kappa-type opioid receptor
Name:Kappa-type opioid receptor
Type:G Protein-Coupled Receptor (GPCR)
Mol. Mass.:42648.76
Organism:Homo sapiens (Human)
Description:P41145
Residue:380
BDBM50100983
NameBDBM50100983
Synonyms:CHEMBL3326224
TypeSmall organic molecule
Emp. Form.C24H29ClN2O
Mol. Mass.396.953
SMILESCl.CN(C)[C@]1(CC[C@@]2(CC1)OCCc1c2[nH]c2ccccc12)c1ccccc1