Reaction Details
TargetKappa-type opioid receptor
LigandBDBM50101095
Substrate/Competitorn/a
Meas. Tech.ChEMBL_1453327 (CHEMBL3366611)
Ki 2.6±n/a nM
Citation Schunk, SLinz, KHinze, CFrormann, SOberbörsch, SSundermann, BZemolka, SEnglberger, WGermann, TChristoph, TKögel, BYSchröder, WHarlfinger, SSaunders, DKless, ASchick, HSonnenschein, H Discovery of a Potent Analgesic NOP and Opioid Receptor Agonist: Cebranopadol. ACS Med Chem Lett5:857-62 (2014) 
 
Kappa-type opioid receptor
Name:Kappa-type opioid receptor
Type:G Protein-Coupled Receptor (GPCR)
Mol. Mass.:42648.76
Organism:Homo sapiens (Human)
Description:P41145
Residue:380
BDBM50101095
NameBDBM50101095
Synonyms:CHEMBL3325957
TypeSmall organic molecule
Emp. Form.C30H35FN2O8
Mol. Mass.570.6059
SMILESOC(=O)CC(O)(CC(O)=O)C(O)=O.CN(C)[C@]1(CC[C@@]2(CC1)OCCc1c2[nH]c2ccc(F)cc12)c1ccccc1