Reaction Details
TargetMu-type opioid receptor
LigandBDBM50101101
Substrate/Competitorn/a
Meas. Tech.ChEMBL_1453325 (CHEMBL3366609)
Ki 2.7±n/a nM
Citation Schunk, SLinz, KHinze, CFrormann, SOberbörsch, SSundermann, BZemolka, SEnglberger, WGermann, TChristoph, TKögel, BYSchröder, WHarlfinger, SSaunders, DKless, ASchick, HSonnenschein, H Discovery of a Potent Analgesic NOP and Opioid Receptor Agonist: Cebranopadol. ACS Med Chem Lett5:857-62 (2014) 
 
Mu-type opioid receptor
Name:Mu-type opioid receptor
Type:G Protein-Coupled Receptor (GPCR)
Mol. Mass.:44789.51
Organism:Homo sapiens (Human)
Description:P35372
Residue:400
BDBM50101101
NameBDBM50101101
Synonyms:CHEMBL3325960
TypeSmall organic molecule
Emp. Form.C31H38N2O8
Mol. Mass.566.642
SMILESOC(=O)CC(O)(CC(O)=O)C(O)=O.CN(C)[C@]1(CC[C@@]2(CC1)OCCc1c2[nH]c2ccc(C)cc12)c1ccccc1