Reaction Details
TargetMu-type opioid receptor
LigandBDBM50101099
Substrate/Competitorn/a
Meas. Tech.ChEMBL_1453325 (CHEMBL3366609)
Ki 0.390000±n/a nM
Citation Schunk, SLinz, KHinze, CFrormann, SOberbörsch, SSundermann, BZemolka, SEnglberger, WGermann, TChristoph, TKögel, BYSchröder, WHarlfinger, SSaunders, DKless, ASchick, HSonnenschein, H Discovery of a Potent Analgesic NOP and Opioid Receptor Agonist: Cebranopadol. ACS Med Chem Lett5:857-62 (2014) 
 
Mu-type opioid receptor
Name:Mu-type opioid receptor
Type:G Protein-Coupled Receptor (GPCR)
Mol. Mass.:44789.51
Organism:Homo sapiens (Human)
Description:P35372
Residue:400
BDBM50101099
NameBDBM50101099
Synonyms:CHEMBL3326228
TypeSmall organic molecule
Emp. Form.C24H30ClN3
Mol. Mass.395.968
SMILESCl.CN(C)[C@]1(CC[C@@]2(CC1)NCCc1c2[nH]c2ccccc12)c1ccccc1