Reaction Details
TargetNociceptin receptor
LigandBDBM50101112
Substrate/Competitorn/a
Meas. Tech.ChEMBL_1453323 (CHEMBL3366607)
Ki 97±n/a nM
Citation Schunk, SLinz, KHinze, CFrormann, SOberbörsch, SSundermann, BZemolka, SEnglberger, WGermann, TChristoph, TKögel, BYSchröder, WHarlfinger, SSaunders, DKless, ASchick, HSonnenschein, H Discovery of a Potent Analgesic NOP and Opioid Receptor Agonist: Cebranopadol. ACS Med Chem Lett5:857-62 (2014) 
 
Nociceptin receptor
Name:Nociceptin receptor
Type:G Protein-Coupled Receptor (GPCR)
Mol. Mass.:40702.87
Organism:Homo sapiens (Human)
Description:P41146
Residue:370
BDBM50101112
NameBDBM50101112
Synonyms:CHEMBL3325958
TypeSmall organic molecule
Emp. Form.C30H35FN2O8
Mol. Mass.570.6059
SMILESOC(=O)CC(O)(CC(O)=O)C(O)=O.CN(C)[C@@]1(CC[C@@]2(CC1)OCCc1c2[nH]c2ccc(F)cc12)c1ccccc1