Reaction Details
TargetKappa-type opioid receptor
LigandBDBM50101314
Substrate/Competitorn/a
Meas. Tech.ChEMBL_1454174 (CHEMBL3363204)
Ki>1000±n/a nM
Citation Hirayama, SWada, NNemoto, TIwai, TFujii, HNagase, H Synthesis and Pharmacology of a Novel¿ Opioid Receptor (KOR) Agonist with a 1,3,5-Trioxazatriquinane Skeleton. ACS Med Chem Lett5:868-72 (2014) 
 
Kappa-type opioid receptor
Name:Kappa-type opioid receptor
Type:G Protein-Coupled Receptor (GPCR)
Mol. Mass.:42744.99
Organism:Cavia porcellus (domestic guinea pig)
Description:P41144
Residue:380
BDBM50101314
NameBDBM50101314
Synonyms:CHEMBL3326355
TypeSmall organic molecule
Emp. Form.C20H21NO5
Mol. Mass.355.3844
SMILESCC1(OC2N3C(COC13)OC2(C)c1cccc(O)c1)c1cccc(O)c1