Reaction Details
TargetMu-type opioid receptor
LigandBDBM50101314
Substrate/Competitorn/a
Meas. Tech.ChEMBL_1454172 (CHEMBL3363202)
Ki 293±n/a nM
Citation Hirayama, SWada, NNemoto, TIwai, TFujii, HNagase, H Synthesis and Pharmacology of a Novel¿ Opioid Receptor (KOR) Agonist with a 1,3,5-Trioxazatriquinane Skeleton. ACS Med Chem Lett5:868-72 (2014) 
 
Mu-type opioid receptor
Name:Mu-type opioid receptor
Type:Enzyme Catalytic Domain
Mol. Mass.:44431.62
Organism:MOUSE
Description:OPIATE Mu OPRM1 MOUSE::P42866
Residue:398
BDBM50101314
NameBDBM50101314
Synonyms:CHEMBL3326355
TypeSmall organic molecule
Emp. Form.C20H21NO5
Mol. Mass.355.3844
SMILESCC1(OC2N3C(COC13)OC2(C)c1cccc(O)c1)c1cccc(O)c1