Reaction Details
TargetMu-type opioid receptor
LigandBDBM50101316
Substrate/Competitorn/a
Meas. Tech.ChEMBL_1454172 (CHEMBL3363202)
Ki 735±n/a nM
Citation Hirayama, SWada, NNemoto, TIwai, TFujii, HNagase, H Synthesis and Pharmacology of a Novel¿ Opioid Receptor (KOR) Agonist with a 1,3,5-Trioxazatriquinane Skeleton. ACS Med Chem Lett5:868-72 (2014) 
 
Mu-type opioid receptor
Name:Mu-type opioid receptor
Type:Enzyme Catalytic Domain
Mol. Mass.:44431.62
Organism:MOUSE
Description:OPIATE Mu OPRM1 MOUSE::P42866
Residue:398
BDBM50101316
NameBDBM50101316
Synonyms:CHEMBL3326352
TypeSmall organic molecule
Emp. Form.C20H21NO5
Mol. Mass.355.3844
SMILES[H][C@]12CO[C@]3([H])N1[C@@]([H])(O[C@@]3(C)c1cccc(O)c1)[C@@](C)(O2)c1cccc(O)c1