Reaction Details
TargetMu-type opioid receptor
LigandBDBM50101327
Substrate/Competitorn/a
Meas. Tech.ChEMBL_1454172 (CHEMBL3363202)
Ki>1000±n/a nM
Citation Hirayama, SWada, NNemoto, TIwai, TFujii, HNagase, H Synthesis and Pharmacology of a Novel¿ Opioid Receptor (KOR) Agonist with a 1,3,5-Trioxazatriquinane Skeleton. ACS Med Chem Lett5:868-72 (2014) 
 
Mu-type opioid receptor
Name:Mu-type opioid receptor
Type:Enzyme Catalytic Domain
Mol. Mass.:44431.62
Organism:MOUSE
Description:OPIATE Mu OPRM1 MOUSE::P42866
Residue:398
BDBM50101327
NameBDBM50101327
Synonyms:CHEMBL3326349
TypeSmall organic molecule
Emp. Form.C27H27NO6
Mol. Mass.461.5064
SMILES[H][C@]12O[C@@](C)(c3cccc(O)c3)[C@]3([H])O[C@@](C)(c4cccc(O)c4)[C@]([H])(O[C@@]1(C)c1cccc(O)c1)N23