Reaction Details
TargetDelta-type opioid receptor
LigandBDBM50101315
Substrate/Competitorn/a
Meas. Tech.ChEMBL_1454173 (CHEMBL3363203)
Ki>1000±n/a nM
Citation Hirayama, SWada, NNemoto, TIwai, TFujii, HNagase, H Synthesis and Pharmacology of a Novel¿ Opioid Receptor (KOR) Agonist with a 1,3,5-Trioxazatriquinane Skeleton. ACS Med Chem Lett5:868-72 (2014) 
 
Delta-type opioid receptor
Name:Delta-type opioid receptor
Type:Enzyme Catalytic Domain
Mol. Mass.:40577.25
Organism:MOUSE
Description:P32300
Residue:372
BDBM50101315
NameBDBM50101315
Synonyms:CHEMBL3326353
TypeSmall organic molecule
Emp. Form.C20H21NO5
Mol. Mass.355.3844
SMILES[H][C@]12CO[C@]3([H])N1[C@@]([H])(O[C@@]3(C)c1cccc(O)c1)[C@](C)(O2)c1cccc(O)c1